./configure --prefix=/usr --enable-libgsm --enable-mp3lame --enable-xvid --enable-vorbis --enable-faad --enable-faac --enable-faadbin --enable-gpl --enable-shared --enable-a52 --enable-a52bin --enable-gprof --enable-libogg --enable-pthreads External at revision 20811. At revision 6953. gcc -I"/usr/src/robert/ffmpeg/source/ffmpeg"/libswscale -DHAVE_AV_CONFIG_H -D_FILE_OFFSET_BITS=64 -D_LARGEFILE_SOURCE -D_ISOC9X_SOURCE -I"/usr/src/robert/ffmpeg/source/ffmpeg" -I"/usr/src/robert/ffmpeg/source/ffmpeg" -I"/usr/src/robert/ffmpeg/source/ffmpeg"/libavutil -fomit-frame-pointer -pthread -g -Wdeclaration-after-statement -Wall -Wno-switch -Wdisabled-optimization -Wpointer-arith -Wredundant-decls -Winline -O3 -p -c -o h264.o h264.c h264.c: In function `hl_decode_mb': h264.c:3661: warning: suggest parentheses around arithmetic in operand of ^ h264.c:3667: warning: suggest parentheses around arithmetic in operand of ^ h264.c: In function `decode_cabac_residual': h264.c:6143: warning: passing arg 4 of `decode_significance_8x8_x86' discards qualifiers from pointer target type h264.c:6070: warning: unused variable `last' h264.c: In function `get_te0_golomb': golomb.h:46: warning: inlining failed in call to 'get_ue_golomb': --param inline-unit-growth limit reached h264.c:112: warning: called from here cabac.h: In function `get_cabac_noinline': cabac.h:522: error: can't find a register in class `GENERAL_REGS' while reloading `asm' h264.c: At top level: cabac.h:109: warning: 'put_cabac_static' defined but not used cabac.h:155: warning: 'put_cabac_terminate' defined but not used cabac.h:183: warning: 'put_cabac_u' defined but not used cabac.h:218: warning: 'put_cabac_ueg' defined but not used cabac.h:270: warning: 'refill2' defined but not used cabac.h:808: warning: 'get_cabac_u' defined but not used cabac.h:824: warning: 'get_cabac_ueg' defined but not used make[1]: *** [h264.o] Error 1 make[1]: Leaving directory `/usr/src/robert/ffmpeg/source/ffmpeg/libavcodec' make: *** [lib] Error 2