/usr/include/unistd.h .Tpo" -c -o lbracket.o lbracket.c; \ | then mv -f ".deps/lbracket.Tpo" ".deps/lbracket.Po"; else rm -f ".deps/lbracket.Tpo"; exit 1; fi | In file included from lbracket.c:2: | test.c:129: error: static declaration of 'eaccess' follows non-static declaration | /usr/include/unistd.h:266: error: previous declaration of 'eaccess' was here | make[3]: *** [lbracket.o] Error 1 | make[3]: Leaving directory `/opt/embedded/familiar-build/build-h6300-gpe/tmp/work/arm-linux/coreutils-native-5.1.3-r7/coreutils-5.1.3/src' | make[2]: *** [all] Error 2 | make[2]: Leaving directory `/opt/embedded/familiar-build/build-h6300-gpe/tmp/work/arm-linux/coreutils-native-5.1.3-r7/coreutils-5.1.3/src' | make[1]: *** [all-recursive] Error 1 | make[1]: Leaving directory `/opt/embedded/familiar-build/build-h6300-gpe/tmp/work/arm-linux/coreutils-native-5.1.3-r7/coreutils-5.1.3' | make: *** [all] Error 2 | FATAL: oe_runmake failed build-h6300-gpe/tmp/staging/arm-linux/include -I.. -I/opt/embedded/familiar-build/build-h6300-gpe/tmp/work/arm-linux/rxvt-unicode-5.6-r4/rxvt-unicode-5.6/src -I. -c rxvt.C | In file included from rxvt.h:4, | from rxvt.C:24: | rxvtlib.h:49:2: #error set intp_t | rxvtlib.h:51:2: #error set u_intp_t | make: *** [rxvt.o] Error 1 | make: Leaving directory `/opt/embedded/familiar-build/build-h6300-gpe/tmp/work/arm-linux/rxvt-unicode-5.6-r4/rxvt-unicode-5.6/src' | FATAL: oe_runmake failed