nullhost win # emerge k3b | nopaste /usr/share/aclocal/libglade.m4:7: warning: underquoted definition of AM_PATH_LIBGLADE run info '(automake)Extending aclocal' or see http://sources.redhat.com/automake/automake.html#Extending-aclocal QA Notice: USE Flag 'doc' not in IUSE for dev-cpp/gnome-vfsmm-2.12.0 ../../libgnomevfs/libgnomevfsmm/mime-handlers.h:75: error: expected constructor, destructor, or type conversion before '*' token make[4]: *** [mime-handlers.lo] Error 1 make[4]: *** Waiting for unfinished jobs.... make[3]: *** [all-recursive] Error 1 make[2]: *** [all-recursive] Error 1 make[1]: *** [all] Error 2 make: *** [all-recursive] Error 1 !!! ERROR: dev-cpp/gnome-vfsmm-2.12.0 failed. Call stack: ebuild.sh, line 1568: Called dyn_compile ebuild.sh, line 937: Called src_compile gnome-vfsmm-2.12.0.ebuild, line 30: Called gnome2_src_compile gnome2.eclass, line 64: Called die !!! compile failure !!! If you need support, post the topmost build error, and the call stack if relevant. http://www.rafb.net/paste/results/dGdZvt65.html