collect2: ld returned 1 exit status make[2]: *** [evolution-exchange-storage] Error 1 make[2]: Leaving directory `/var/tmp/portage/evolution-exchange-2.6.2-r1/work/ev olution-exchange-2.6.2/storage' make[1]: *** [all-recursive] Error 1 make[1]: Leaving directory `/var/tmp/portage/evolution-exchange-2.6.2-r1/work/ev olution-exchange-2.6.2' make: *** [all] Error 2 !!! ERROR: gnome-extra/evolution-exchange-2.6.2-r1 failed. Call stack: ebuild.sh, line 1546: Called dyn_compile ebuild.sh, line 937: Called src_compile ebuild.sh, line 1255: Called gnome2_src_compile gnome2.eclass, line 64: Called die