gcc -I. -I/home/maraujo/validate_ptbr -DPHP_ATOM_INC -I/home/maraujo/validate_ptbr/include -I/home/maraujo/validate_ptbr/main -I/home/maraujo/validate_ptbr -I/usr/local/include/php -I/usr/local/include/php/main -I/usr/local/include/php/TSRM -I/usr/local/include/php/Zend -I/usr/local/include/php/ext -I/usr/local/include/php/ext/date/lib -DHAVE_CONFIG_H -g -O2 -c /home/maraujo/validate_ptbr/validate_ptbr.c -fPIC -DPIC -o .libs/validate_ptbr.o /home/maraujo/validate_ptbr/validate_ptbr.c:43: error: 'zim_Validate_ptBR_cpf' undeclared here (not in a function) /home/maraujo/validate_ptbr/validate_ptbr.c:44: error: 'zim_Validate_ptBR_cnpj' undeclared here (not in a function) /home/maraujo/validate_ptbr/validate_ptbr.c:56: error: 'validate_ptbr_functions' undeclared here (not in a function) /home/maraujo/validate_ptbr/validate_ptbr.c:56: error: initializer element is not constant /home/maraujo/validate_ptbr/validate_ptbr.c:56: error: (near initialization for 'validate_ptbr_module_entry.functions') make: *** [validate_ptbr.lo] Error 1