/bin/sh /var/tmp/portage/gcc-4.1.1-r1/work/gcc-4.1.1/gcc/../move-if-change tmp-attrtab.c insn-attrtab.c insn-attrtab.c is unchanged echo timestamp > s-attrtab stage1/xgcc -Bstage1/ -B/usr/i586-pc-linux-gnu/bin/ -O2 -mtune=i686 -pipe -fprofile-generate -DIN_GCC -W -Wall -Wwrite-strings -Wstrict-prototypes -Wmissing-prototypes -pedantic -Wno-long-long -Wno-variadic-macros -Wold-style-definition -Wmissing-format-attribute -DHAVE_CONFIG_H -I. -I. -I/var/tmp/portage/gcc-4.1.1-r1/work/gcc-4.1.1/gcc -I/var/tmp/portage/gcc-4.1.1-r1/work/gcc-4.1.1/gcc/. -I/var/tmp/portage/gcc-4.1.1-r1/work/gcc-4.1.1/gcc/../include -I/var/tmp/portage/gcc-4.1.1-r1/work/gcc-4.1.1/gcc/../libcpp/include -c insn-attrtab.c \ -o insn-attrtab.o {standard input}: Assembler messages: {standard input}:33467: Warning: end of file not at end of a line; newline inserted xgcc: Internal error: Killed (program cc1) Please submit a full bug report. See for instructions. make[2]: *** [insn-attrtab.o] Error 1 make[2]: Leaving directory `/var/tmp/portage/gcc-4.1.1-r1/work/build/gcc' make[1]: *** [stageprofile_build] Error 2 make[1]: Leaving directory `/var/tmp/portage/gcc-4.1.1-r1/work/build/gcc' make: *** [profiledbootstrap] Error 2 !!! ERROR: sys-devel/gcc-4.1.1-r1 failed. Call stack: ebuild.sh, line 1546: Called dyn_compile ebuild.sh, line 937: Called src_compile ebuild.sh, line 1255: Called toolchain_src_compile toolchain.eclass, line 24: Called gcc_src_compile toolchain.eclass, line 1536: Called gcc_do_make toolchain.eclass, line 1410: Called die !!! emake failed with profiledbootstrap !!! If you need support, post the topmost build error, and the call stack if relevant.