264_plugin_a-x264.o -MD -MP -MF ".deps/libx264_plugin_a-x264.Tpo" -c -o libx264_plugin_a-x264.o `test -f 'x264.c' || echo './'`x264.c; \ then mv -f ".deps/libx264_plugin_a-x264.Tpo" ".deps/libx264_plugin_a-x264.Po"; else rm -f ".deps/libx264_plugin_a-x264.Tpo"; exit 1; fi x264.c: In function ‘Open’: x264.c:749: error: ‘struct ’ has no member named ‘i_rf_constant’ x264.c:838: warning: pointer targets in passing argument 1 of ‘p_symbols->vlc_ureduce_inner’ differ in signedness x264.c:838: warning: pointer targets in passing argument 2 of ‘p_symbols->vlc_ureduce_inner’ differ in signedness make[4]: *** [libx264_plugin_a-x264.o] Fehler 1 make[4]: Leaving directory `/usr/src/packages/BUILD/vlc-0.8.5/modules/codec' make[3]: *** [all-modules] Fehler 1 make[3]: Leaving directory `/usr/src/packages/BUILD/vlc-0.8.5/modules/codec' make[2]: *** [all-recursive] Fehler 1 make[2]: Leaving directory `/usr/src/packages/BUILD/vlc-0.8.5/modules' make[1]: *** [all-recursive] Fehler 1 make[1]: Leaving directory `/usr/src/packages/BUILD/vlc-0.8.5' make: *** [all] Fehler 2