Making all for framework GNUMail... Compiling file AboutPanel.m ... In file included from AboutPanel.m:27: Utilities.h:156: error: expected ‘)’ before ‘PantomimeForwardMode’ make[3]: *** [shared_obj/AboutPanel.o] Error 1 make[2]: *** [GNUMail.all.framework.variables] Error 2 make[2]: Leaving directory `/home/lontra/GNUMail/Framework/GNUMail' make[1]: *** [internal-all] Error 2 make[1]: Leaving directory `/home/lontra/GNUMail' make: *** [debian/stamp-makefile-build] Error 2 debuild: fatal error at line 1228: debian/rules build failed