# make make -C src/ clean make[1]: Entering directory `/home/david/Downloads/r1000_v1.04/src' rm -f *.o *.ko *~ core* .dep* .*.d .*.cmd *.mod.c *.a *.s .*.flags make[1]: Leaving directory `/home/david/Downloads/r1000_v1.04/src' make -C src/ modules make[1]: Entering directory `/home/david/Downloads/r1000_v1.04/src' make -C /lib/modules/2.6.17-2-686/build SUBDIRS=/home/david/Downloads/r1000_v1.04/src modules make[2]: Entering directory `/usr/src/linux-headers-2.6.17-2-686' CC [M] /home/david/Downloads/r1000_v1.04/src/r1000_n.o /home/david/Downloads/r1000_v1.04/src/r1000_n.c:51: error: expected ‘)’ before string constant /home/david/Downloads/r1000_v1.04/src/r1000_n.c:52: error: expected ‘)’ before string constant /home/david/Downloads/r1000_v1.04/src/r1000_n.c:53: error: expected ‘)’ before string constant make[3]: *** [/home/david/Downloads/r1000_v1.04/src/r1000_n.o] Error 1 make[2]: *** [_module_/home/david/Downloads/r1000_v1.04/src] Error 2 make[2]: Leaving directory `/usr/src/linux-headers-2.6.17-2-686' make[1]: *** [modules] Error 2 make[1]: Leaving directory `/home/david/Downloads/r1000_v1.04/src' make: *** [modules] Error 2