edje_main.h:16:24: error: Ecore_Evas.h: No such file or directory make[3]: *** [edje_cc.o] Error 1 make[3]: Leaving directory `/home/joe/pkgbuilds/edje-cvs/src/e17-build/libs/edje/src/bin' make[2]: *** [all-recursive] Error 1 make[2]: Leaving directory `/home/joe/pkgbuilds/edje-cvs/src/e17-build/libs/edje/src' make[1]: *** [all-recursive] Error 1 make[1]: Leaving directory `/home/joe/pkgbuilds/edje-cvs/src/e17-build/libs/edje' make: *** [all] Error 2 ==> ERROR: Build Failed. Aborting...