/usr/lib64/libwx_gtk2u_core-2.6.so: undefined reference to `pango_x_get_context' collect2: ld returned 1 exit status make[2]: *** [xchm] Error 1 make[2]: Leaving directory `/var/tmp/portage/xchm-1.1/work/xchm-1.1/src' make[1]: *** [all-recursive] Error 1 make[1]: Leaving directory `/var/tmp/portage/xchm-1.1/work/xchm-1.1' make: *** [all] Error 2 !!! ERROR: x11-misc/xchm-1.1 failed. !!! Function src_compile, Line 30, Exitcode 2 !!! emake failed !!! If you need support, post the topmost build error, NOT this status message.