UW PICO(tm) 4.10 File: nvidia-installer.log Modified warning: #warning "conftest.sh failed, assuming remap_page_range(4)!" /tmp/selfgz2041/NVIDIA-Linux-x86-1.0-7174-pkg1/usr/src/nv/os-interface.c:667 :5: warning: "DEBUG" is not defined /tmp/selfgz2041/NVIDIA-Linux-x86-1.0-7174-pkg1/usr/src/nv/os-interface.c:679 :5: warning: "DEBUG" is not defined /tmp/selfgz2041/NVIDIA-Linux-x86-1.0-7174-pkg1/usr/src/nv/os-interface.c: In function `os_set_mlock_capability': /tmp/selfgz2041/NVIDIA-Linux-x86-1.0-7174-pkg1/usr/src/nv/os-interface.c:126 2: error: structure has no member named `rlim' make[4]: *** [/tmp/selfgz2041/NVIDIA-Linux-x86-1.0-7174-pkg1/usr/src/nv/os-i nterface.o] Error 1 make[3]: *** [_module_/tmp/selfgz2041/NVIDIA-Linux-x86-1.0-7174-pkg1/usr/src /nv] Error 2 make[2]: *** [modules] Error 2 NVIDIA: left KBUILD. nvidia.ko failed to build! make[1]: *** [module] Error 1 make: *** [module] Error 2 -> Error. ERROR: Unable to build the NVIDIA kernel module. ERROR: Installation has failed. Please see the file '/var/log/nvidia-installer.log' for details. You may find suggestions on fixing installation problems in the README available on the Linux driver download page at www.nvidia.com.