make[2]: *** [read-rtl.o] Error 1 make[2]: *** Waiting for unfinished jobs.... make[2]: Leaving directory `/var/tmp/portage/gcc-3.3.2-r7/work/build/gcc' make[1]: *** [stage1_build] Error 2 make[1]: Leaving directory `/var/tmp/portage/gcc-3.3.2-r7/work/build/gcc' make: *** [bootstrap-lean] Error 2 !!! ERROR: sys-devel/gcc-3.3.2-r7 failed. Call stack: ebuild.sh, line 1546: Called dyn_compile ebuild.sh, line 937: Called src_compile gcc-3.3.2-r7.ebuild, line 438: Called die