collect2: ld returned 1 exit status make[3]: *** [libartskde.la] Error 1 make[3]: Leaving directory `/var/tmp/portage/kdelibs-3.5.5-r5/work/kdelibs-3.5.5/arts/kde' make[2]: *** [all-recursive] Error 1 make[2]: Leaving directory `/var/tmp/portage/kdelibs-3.5.5-r5/work/kdelibs-3.5.5/arts' make[1]: *** [all-recursive] Error 1 make[1]: Leaving directory `/var/tmp/portage/kdelibs-3.5.5-r5/work/kdelibs-3.5.5' make: *** [all] Error 2 !!! ERROR: kde-base/kdelibs-3.5.5-r5 failed. Call stack: ebuild.sh, line 1546: Called dyn_compile ebuild.sh, line 937: Called src_compile kdelibs-3.5.5-r5.ebuild, line 134: Called kde_src_compile kde.eclass, line 172: Called kde_src_compile 'all' kde.eclass, line 342: Called kde_src_compile 'myconf' 'configure' 'make' kde.eclass, line 338: Called die !!! died running emake, kde_src_compile:make !!! If you need support, post the topmost build error, and the call stack if relevant.