ance.cpp' || echo './'`libnrtype/FontInstance.cpp; \ then mv -f "libnrtype/.deps/FontInstance.Tpo" "libnrtype/.deps/FontInsta nce.Po"; else rm -f "libnrtype/.deps/FontInstance.Tpo"; exit 1; fi libnrtype/FontInstance.cpp:29:40: freetype/internal/tttypes.h: No such file or d irectory libnrtype/FontInstance.cpp:30:41: freetype/internal/ftstream.h: No such file or directory libnrtype/FontInstance.cpp: In member function `void font_instance::LoadGlyph(in t)': libnrtype/FontInstance.cpp:425: error: invalid conversion from `int (*)(FT_Vecto r*, void*)' to `int (*)(const FT_Vector*, void*)' libnrtype/FontInstance.cpp:425: error: invalid conversion from `int (*)(FT_Vecto r*, void*)' to `int (*)(const FT_Vector*, void*)' libnrtype/FontInstance.cpp:425: error: invalid conversion from `int (*)(FT_Vecto r*, FT_Vector*, void*)' to `int (*)(const FT_Vector*, const FT_Vector*, void*)' libnrtype/FontInstance.cpp:425: error: invalid conversion from `int (*)(FT_Vecto r*, FT_Vector*, FT_Vector*, void*)' to `int (*)(const FT_Vector*, const FT_Vecto r*, const FT_Vector*, void*)' libnrtype/FontInstance.cpp: In member function `bool font_instance::FontSlope(do uble&, double&)': libnrtype/FontInstance.cpp:477: error: `TT_HoriHeader' was not declared in this scope libnrtype/FontInstance.cpp:477: error: `hhea' was not declared in this scope libnrtype/FontInstance.cpp:477: error: expected primary-expression before ')' to ken libnrtype/FontInstance.cpp:477: error: expected `;' before "FT_Get_Sfnt_Table" gmake[2]: *** [libnrtype/FontInstance.o] Error 1 gmake[2]: Leaving directory `/home/lucho/inkscape-0.40cvs/src' gmake[1]: *** [all-recursive] Error 1 gmake[1]: Leaving directory `/home/lucho/inkscape-0.40cvs' gmake: *** [all] Error 2