vainio26@haikara harj3 $ make tutg++ -o prog *.cc tietorakenne.cc: In constructor 'Tietorakenne::Tietorakenne()': tietorakenne.cc:30: error: no match for call to '(std::map, std::allocator >, std::less, std::allocator > >, std::allocator, std::allocator > > >, std::less, std::allocator, std::allocator >, std::less, std::allocator > >, std::allocator, std::allocator > > > > > >) ()' tietorakenne.cc:31: error: expected `;' before '}' token tietorakenne.cc: In member function 'bool Tietorakenne::kohdeOk(std::string)': tietorakenne.cc:195: warning: declaration of 'asuntokohde' shadows a member of 'this' make: *** [prog] Error 1