---------------------------- Installing applications --------------------------- - e .......................... ERROR! -------------------------------------------------------------------------------- ----------------------------------- Last loglines ------------------------------ make[3]: Entering directory `/home/raven/e17_cvs/e17/apps/e/data' make[3]: Nothing to be done for `all-am'. make[3]: Leaving directory `/home/raven/e17_cvs/e17/apps/e/data' make[2]: Leaving directory `/home/raven/e17_cvs/e17/apps/e/data' Making all in doc make[2]: Entering directory `/home/raven/e17_cvs/e17/apps/e/doc' make[2]: Nothing to be done for `all'. make[2]: Leaving directory `/home/raven/e17_cvs/e17/apps/e/doc' Making all in po make[2]: Entering directory `/home/raven/e17_cvs/e17/apps/e/po' test -z "bg.gmo ja.gmo ru.gmo hu.gmo sl.gmo it.gmo fr.gmo" || make bg.gmo ja.gmo ru.gmo hu.gmo sl.gmo it.gmo fr.gmo make[3]: Entering directory `/home/raven/e17_cvs/e17/apps/e/po' rm -f bg.gmo && /usr/bin/msgfmt -c --statistics -o bg.gmo bg.po bg.po:4190: number of format specifications in 'msgid' and 'msgstr' does not match bg.po:4212: number of format specifications in 'msgid' and 'msgstr' does not match bg.po:5134: number of format specifications in 'msgid' and 'msgstr' does not match /usr/bin/msgfmt: found 3 fatal errors 1235 translated messages, 199 untranslated messages. make[3]: *** [bg.gmo] Error 1 make[3]: Leaving directory `/home/raven/e17_cvs/e17/apps/e/po' make[2]: *** [stamp-po] Error 2 make[2]: Leaving directory `/home/raven/e17_cvs/e17/apps/e/po' make[1]: *** [all-recursive] Error 1 make[1]: Leaving directory `/home/raven/e17_cvs/e17/apps/e' make: *** [all] Error 2