make[3]: Entering directory `/home/brent/Jokosher0.2checkout/gst/gstreamer/tests/check' if gcc -DHAVE_CONFIG_H -I. -I. -I../.. -I../../libs -I../.. -I../.. -pthread -I/usr/include/glib-2.0 -I/usr/lib/glib-2.0/include -I/usr/include/libxml2 -Wall -Werror -g -DGST_DISABLE_DEPRECATED -g -O2 -MT collectpads.o -MD -MP -MF ".deps/collectpads.Tpo" \ -c -o collectpads.o `test -f 'libs/collectpads.c' || echo './'`libs/collectpads.c; \ then mv -f ".deps/collectpads.Tpo" ".deps/collectpads.Po"; \ else rm -f ".deps/collectpads.Tpo"; exit 1; \ fi cc1: warnings being treated as errors libs/collectpads.c: In function ‘gst_collect_pads_suite’: libs/collectpads.c:340: warning: passing argument 2 of ‘_tcase_add_test’ from incompatible pointer type libs/collectpads.c:341: warning: passing argument 2 of ‘_tcase_add_test’ from incompatible pointer type libs/collectpads.c:342: warning: passing argument 2 of ‘_tcase_add_test’ from incompatible pointer type libs/collectpads.c:343: warning: passing argument 2 of ‘_tcase_add_test’ from incompatible pointer type make[3]: *** [collectpads.o] Error 1 make[3]: Leaving directory `/home/brent/Jokosher0.2checkout/gst/gstreamer/tests/check' make[2]: *** [all-recursive] Error 1 make[2]: Leaving directory `/home/brent/Jokosher0.2checkout/gst/gstreamer/tests' make[1]: *** [all-recursive] Error 1 make[1]: Leaving directory `/home/brent/Jokosher0.2checkout/gst/gstreamer' make: *** [all] Error 2 /home/brent/Jokosher0.2checkout/gst/gstreamer