cc1: out of memory allocating 154957568 bytes after a total of 108380160 bytes make[2]: *** [vartest.o] Error 1 make[1]: *** [oleaut32/tests] Error 2 make[1]: *** Waiting for unfinished jobs.... make: *** [dlls] Error 2 !!! ERROR: app-emulation/wine-0.9.26 failed. Call stack: ebuild.sh, line 1564: Called dyn_compile ebuild.sh, line 937: Called src_compile wine-0.9.26.ebuild, line 113: Called die