cc1: out of memory allocating 154987372 bytes after a total of 108257280 bytes make[2]: *** [vartest.o] Error 1 make[1]: *** [oleaut32/tests] Error 2 make[1]: *** Waiting for unfinished jobs.... make: *** [dlls] Error 2 !!! ERROR: app-emulation/wine-0.9.27 failed. Call stack: ebuild.sh, line 1576: Called dyn_compile ebuild.sh, line 945: Called src_compile wine-0.9.27.ebuild, line 113: Called die !!! all !!! If you need support, post the topmost build error, and the call stack if relevant.