make[4]: Entering directory `/usr/src/gcc-4.1.1.bld/gcc' ./xgcc -B./ -B/usr/x86_64-pc-linux-gnu/bin/ -isystem /usr/x86_64-pc-linux-gnu/include -isystem /usr/x86_64-pc-linux-gnu/sys-include -L/usr/src/gcc-4.1.1.bld/gcc/../ld -O2 -O2 -O -march=k8 -mmmx -mfpmath=sse -msse -msse2 -m3dnow -m64 -fPIC -DPIC -pipe -DPIC -fPIC -O3 -DIN_GCC -W -Wall -Wwrite-strings -Wstrict-prototypes -Wmissing-prototypes -Wold-style-definition -isystem ./include -I. -I32 -I/usr/src/gcc-4.1.1/gcc -I/usr/src/gcc-4.1.1/gcc/32 -I/usr/src/gcc-4.1.1/gcc/../include -I/usr/src/gcc-4.1.1/gcc/../libcpp/include -m32 -g0 -finhibit-size-directive -fno-inline-functions -fno-exceptions -fno-zero-initialized-in-bss -fno-unit-at-a-time -fno-omit-frame-pointer -fno-asynchronous-unwind-tables \ -c /usr/src/gcc-4.1.1/gcc/crtstuff.c -DCRT_BEGIN \ -o 32/crtbegin.o {standard input}: Assembler messages: {standard input}:34: Error: suffix or operands invalid for `push' {standard input}:36: Error: suffix or operands invalid for `push' {standard input}:38: Internal error, aborting at ../../gas/config/tc-i386.c line 3652 in output_imm Please report this bug. make[4]: *** [32/crtbegin.o] Error 1 make[4]: Leaving directory `/usr/src/gcc-4.1.1.bld/gcc' make[3]: *** [extra32] Error 2 make[3]: Leaving directory `/usr/src/gcc-4.1.1.bld/gcc' make[2]: *** [stmp-multilib] Error 2 make[2]: Leaving directory `/usr/src/gcc-4.1.1.bld/gcc' make[1]: Leaving directory `/usr/src/gcc-4.1.1.bld/gcc' make[1]: *** [stage1_build] Error 2 make: *** [profiledbootstrap] Error 2