make[2]: Entering directory `/home/whirm/src/buildroot/buildroot-svn/build_i386/mpg123-0.59r' make[3]: Entering directory `/home/whirm/src/buildroot/buildroot-svn/build_i386/mpg123-0.59r' as -o decode_i586.o decode_i586.s decode_i586.s: Assembler messages: decode_i586.s:44: Error: suffix or operands invalid for `push' decode_i586.s:45: Error: suffix or operands invalid for `push' decode_i586.s:46: Error: suffix or operands invalid for `push' decode_i586.s:47: Error: suffix or operands invalid for `push' decode_i586.s:67: Error: suffix or operands invalid for `push' decode_i586.s:70: Error: suffix or operands invalid for `push' decode_i586.s:81: Error: suffix or operands invalid for `push' decode_i586.s:83: Error: suffix or operands invalid for `push' decode_i586.s:86: Error: suffix or operands invalid for `push' decode_i586.s:161: Error: suffix or operands invalid for `pop' decode_i586.s:211: Error: suffix or operands invalid for `pop' decode_i586.s:296: Error: suffix or operands invalid for `pop' decode_i586.s:315: Error: suffix or operands invalid for `pop' decode_i586.s:316: Error: suffix or operands invalid for `pop' decode_i586.s:317: Error: suffix or operands invalid for `pop' decode_i586.s:318: Error: suffix or operands invalid for `pop' make[3]: *** [decode_i586.o] Error 1 make[3]: Leaving directory `/home/whirm/src/buildroot/buildroot-svn/build_i386/mpg123-0.59r' make[2]: *** [mpg123-make] Error 2 make[2]: Leaving directory `/home/whirm/src/buildroot/buildroot-svn/build_i386/mpg123-0.59r' make[1]: *** [linux] Error 2 make[1]: Leaving directory `/home/whirm/src/buildroot/buildroot-svn/build_i386/mpg123-0.59r' make: *** [/home/whirm/src/buildroot/buildroot-svn/build_i386/mpg123-0.59r/mpg123] Error 2 whirm@sphynx:~/src/buildroot/buildroot-svn$