utils.c:(.text+0x50): undefined reference to `wine_cp_get_table' utils.o: In function `convert_string': utils.c:(.text+0x3de): undefined reference to `wine_cp_get_table' utils.c:(.text+0x4e5): undefined reference to `wine_cp_wcstombs' utils.c:(.text+0x52d): undefined reference to `wine_cp_wcstombs' utils.c:(.text+0x577): undefined reference to `wine_cp_mbstowcs' utils.c:(.text+0x5b2): undefined reference to `wine_cp_mbstowcs' utils.o: In function `compare_name_id': utils.c:(.text+0x9b4): undefined reference to `strcmpiW' parser.yy.o: In function `parser_lex': parser.yy.c:(.text+0x2995): undefined reference to `wine_cp_get_table' collect2: ld returned 1 exit status make[2]: *** [wrc] Error 1 make[1]: *** [wrc] Error 2 make: *** [tools] Error 2 !!! ERROR: app-emulation/wine-0.9.27 failed. Call stack: ebuild.sh, line 1576: Called dyn_compile ebuild.sh, line 945: Called src_compile wine-0.9.27.ebuild, line 113: Called die