ICU_DATA=../data/out/build LD_LIBRARY_PATH=../common:../i18n:../tools/toolutil:../layout:../layoutex:../extra/ustdio:../tools/ctestfw:../data/out:../data:../stubdata/:$LD_LIBRARY_PATH ../tools/genbrk/genbrk -r ../data/brkitr/line.txt -o ../data/out/build/icudt26l_line.brk createRuleBasedBreakIterator: ICU Error "U_FILE_ACCESS_ERROR" at line 0, column 0 gmake[1]: *** [../data/out/build/icudt26l_char.brk] Error 4 gmake[1]: createRuleBasedBreakIterator: ICU Error "U_FILE_ACCESS_ERROR" at line 0, column 0 *** Waiting for unfinished jobs.... gmake[1]: *** [../data/out/build/icudt26l_line.brk] Error 4 gmake[1]: Leaving directory `/usr/ports/editors/openoffice.org-2/work/OOE680_m6/icu/unxfbsdi.pro/misc/build/icu/source/data' gmake: *** [all-recursive] Error 2 dmake: Error code 2, while making './unxfbsdi.pro/misc/build/so_built_so_icu' '---* tg_merge.mk *---' ERROR: Error 65280 occurred while making /usr/ports/editors/openoffice.org-2/work/OOE680_m6/icu dmake: Error code 1, while making 'build_instsetoo_native' '---* *---' *** Error code 255 1 error