x86_64-pld-linux-g++ -DHAVE_CONFIG_H -I. -I.. -I/usr/lib64/wx/include/gtk2-unicode-release-2.8 -I/usr/include/wx-2.8 -D_FILE_OFFSET_BITS=64 -D_LARGE_FILES -D__WXGTK__ -pthread -I./libs -Ilibs -O2 -fno-strict-aliasing -fwrapv -march=x86-64 -gdwarf-2 -g2 -DUSE_EMBEDDED_CRYPTO -W -Wall -Wshadow -Wundef -O2 -MT amule-amule.o -MD -MP -MF .deps/amule-amule.Tpo -c -o amule-amule.o `test -f 'amule.cpp' || echo './'`amule.cpp In file included from amule.cpp:80: FriendList.h:63:3: warning: #warning THIS MUST BE MADE PRIVATE AFTER EC IS CODED In file included from /usr/include/wx-2.8/wx/event.h:21, from /usr/include/wx-2.8/wx/process.h:15, from amule.cpp:32: /usr/include/wx-2.8/wx/gdicmn.h: In member function ‘bool wxRect::Inside(int, int) const’: /usr/include/wx-2.8/wx/gdicmn.h:486: warning: declaration of ‘y’ shadows a member of 'this' /usr/include/wx-2.8/wx/gdicmn.h:486: warning: declaration of ‘x’ shadows a member of 'this' amule.cpp: In member function ‘void CamuleApp::OnCoreTimer(CMuleInternalEvent&)’: amule.cpp:1327: error: invalid use of incomplete type ‘struct wxWindow’ /usr/include/wx-2.8/wx/utils.h:51: error: forward declaration of ‘struct wxWindow’ make[3]: *** [amule-amule.o] Błąd 1 make[3]: Opuszczenie katalogu `/home/users/arekm/rpm/BUILD/aMule-2.1.3/src'