root@atoms-feisty:/opt/RT61_Linux_STA_Drv1.1.0.0/Module# make all make -C /lib/modules/2.6.20-2-386/build SUBDIRS=/opt/RT61_Linux_STA_Drv1.1.0.0/Module modules make[1]: Entering directory `/usr/src/linux-headers-2.6.20-2-386' CC [M] /opt/RT61_Linux_STA_Drv1.1.0.0/Module/rtmp_main.o /opt/RT61_Linux_STA_Drv1.1.0.0/Module/rtmp_main.c: In function ‘RT61_probe’: /opt/RT61_Linux_STA_Drv1.1.0.0/Module/rtmp_main.c:197: error: ‘struct net_device’ has no member named ‘get_wireless_stats’ /opt/RT61_Linux_STA_Drv1.1.0.0/Module/rtmp_main.c: In function ‘RT61_open’: /opt/RT61_Linux_STA_Drv1.1.0.0/Module/rtmp_main.c:326: warning: passing argument 2 of ‘request_irq’ from incompatible pointer type make[2]: *** [/opt/RT61_Linux_STA_Drv1.1.0.0/Module/rtmp_main.o] Error 1 make[1]: *** [_module_/opt/RT61_Linux_STA_Drv1.1.0.0/Module] Error 2 make[1]: Leaving directory `/usr/src/linux-headers-2.6.20-2-386' make: *** [all] Error 2