then mv -f ".deps/e_widget_scrollframe.Tpo" ".deps/e_widget_scrollframe.Po"; else rm -f ".deps/e_widget_scrollframe.Tpo"; exit 1; fi e_fm.c: In function '_e_fm2_cb_icon_thumb_dnd_gen': e_fm.c:3582: error: 'EDJE_ASPECT_CONTROL_BOTH' undeclared (first use in this function) e_fm.c:3582: error: (Each undeclared identifier is reported only once e_fm.c:3582: error: for each function it appears in.) e_fm.c: In function '_e_fm2_cb_icon_thumb_gen': e_fm.c:3607: error: 'EDJE_ASPECT_CONTROL_BOTH' undeclared (first use in this function) make[3]: *** [e_fm.o] Error 1 make[3]: *** Waiting for unfinished jobs.... make[3]: Leaving directory `/var/tmp/portage/e-9999/work/e17/apps/e/src/bin' make[2]: *** [all-recursive] Error 1 make[2]: Leaving directory `/var/tmp/portage/e-9999/work/e17/apps/e/src' make[1]: *** [all-recursive] Error 1 make[1]: Leaving directory `/var/tmp/portage/e-9999/work/e17/apps/e' make: *** [all] Error 2 * This is a LIVE CVS ebuild. * That means there are NO promises it will work. * If it fails to build, FIX THE CODE YOURSELF * before reporting any issues. !!! ERROR: x11-wm/e-9999 failed. Call stack: ebuild.sh, line 1546: Called dyn_compile ebuild.sh, line 937: Called src_compile ebuild.sh, line 1255: Called enlightenment_src_compile enlightenment.eclass, line 156: Called enlightenment_die 'emake failed' enlightenment.eclass, line 106: Called die !!! emake failed !!! SEND BUG REPORTS TO vapier@gentoo.org NOT THE E TEAM !!! If you need support, post the topmost build error, and the call stack if relevant. shirley james #