make: Nothing to be done for `update'. [src/postconf] gcc -Wmissing-prototypes -Wformat -DHAS_PCRE -g -O -I. -I../../include -DLINUX2 -c postconf.c In file included from postconf.c:198: bool_vars.h:30: error: expected identifier or â(â before â;â token bool_vars.h:31: error: expected identifier or â(â before â;â token bool_vars.h:32: error: expected identifier or â(â before â;â token bool_vars.h:33: error: expected identifier or â(â before â;â token bool_vars.h:34: error: expected identifier or â(â before â;â token bool_vars.h:35: error: expected identifier or â(â before â;â token bool_vars.h:36: error: expected identifier or â(â before â;â token bool_vars.h:37: error: expected identifier or â(â before â;â token make: *** [postconf.o] Error 1 make: *** [update] Error 1