if g++ -DHAVE_CONFIG_H -I. -I. -I.. -fno-stack-protector -I/usr//lib/wx/include/base-ansi-release-2.6 -I/usr//include/wx-2.6 -DwxUSE_GUI=0 -D_FILE_OFFSET_BITS=64 -D_LARGE_FILES -D_LARGEFILE_SOURCE=1 -DNO_GCC_PRAGMA -DwxUSE_GUI=0 -I./libs -DUSE_EMBEDDED_CRYPTO -W -Wall -g -ggdb -fno-inline -D__DEBUG__ -fmessage-length=0 -D_GLIBCXX_DEBUG -D_GLIBCXX_DEBUG_PEDANTIC -MT libmuleappcore_a-AsyncDNS.o -MD -MP -MF ".deps/libmuleappcore_a-AsyncDNS.Tpo" -c -o libmuleappcore_a-AsyncDNS.o `test -f 'AsyncDNS.cpp' || echo './'`AsyncDNS.cpp; \ then mv -f ".deps/libmuleappcore_a-AsyncDNS.Tpo" ".deps/libmuleappcore_a-AsyncDNS.Po"; else rm -f ".deps/libmuleappcore_a-AsyncDNS.Tpo"; exit 1; fi In file included from AsyncDNS.cpp:28: amule.h:316: error: `wxCloseEvent' has not been declared amule.h:316: error: ISO C++ forbids declaration of `evt' with no type make[3]: *** [libmuleappcore_a-AsyncDNS.o] Error 1 make[3]: Leaving directory `/home/users/steve/amule-dev/src' make[2]: *** [all-recursive] Error 1 make[2]: Leaving directory `/home/users/steve/amule-dev/src' make[1]: *** [all-recursive] Error 1 make[1]: Leaving directory `/home/users/steve/amule-dev' make: *** [all] Error 2