./../raki/threadevent.h:48: error: los argumentos por defecto sólo se permiten para parámetros de función rakisyncplugin.cpp: In member function ‘void RakiSyncPlugin::incTotalSteps(int)’: rakisyncplugin.cpp:142: error: los argumentos por defecto sólo se permiten para parámetros de función rakisyncplugin.cpp: In member function ‘void RakiSyncPlugin::decTotalSteps(int)’: rakisyncplugin.cpp:150: error: los argumentos por defecto sólo se permiten para parámetros de función rakisyncplugin.cpp: In member function ‘void RakiSyncPlugin::advanceProgress()’: rakisyncplugin.cpp:156: error: los argumentos por defecto sólo se permiten para parámetros de función rakisyncplugin.cpp: In member function ‘void RakiSyncPlugin::setTotalSteps(int)’: rakisyncplugin.cpp:164: error: los argumentos por defecto sólo se permiten para parámetros de función rakisyncplugin.cpp: In member function ‘void RakiSyncPlugin::setProgress(int)’: rakisyncplugin.cpp:172: error: los argumentos por defecto sólo se permiten para parámetros de función rakisyncplugin.cpp: In member function ‘void RakiSyncPlugin::setTask(const char*)’: rakisyncplugin.cpp:178: error: los argumentos por defecto sólo se permiten para parámetros de función make[3]: *** [rakisyncplugin.o] Error 1