make[2]: entrant dans le répertoire « /home/cspnico/linux-wlan-ng-0.2.1pre21/src/p80211 » if test ! -d /home/cspnico/linux-wlan-ng-0.2.1pre21/src/p80211/../.tmp_versions; then \ cp -rf /usr/src/linux-headers-2.6.8.1-3-386//.tmp_versions /home/cspnico/linux-wlan-ng-0.2.1pre21/src/p80211/../ ; \ fi make -C /usr/src/linux-headers-2.6.8.1-3-386/ SUBDIRS=/home/cspnico/linux-wlan-ng-0.2.1pre21/src/p80211 WLAN_SRC=/home/cspnico/linux-wlan-ng-0.2.1pre21/src/p80211/ \ MODVERDIR=/home/cspnico/linux-wlan-ng-0.2.1pre21/src/p80211/../.tmp_versions modules make[3]: entrant dans le répertoire « /usr/src/linux-headers-2.6.8.1-3-386 » CC [M] /home/cspnico/linux-wlan-ng-0.2.1pre21/src/p80211/p80211mod.o In file included from include/asm/thread_info.h:16, from include/linux/thread_info.h:21, from include/linux/spinlock.h:12, from include/linux/capability.h:45, from include/linux/sched.h:7, from include/linux/module.h:10, from /home/cspnico/linux-wlan-ng-0.2.1pre21/src/p80211/p80211mod.c:62: include/asm/processor.h:87: error: array type has incomplete element type In file included from include/linux/netdevice.h:151, from /home/cspnico/linux-wlan-ng-0.2.1pre21/src/p80211/p80211mod.c:71: include/linux/skbuff.h: In function 'skb_add_data': include/linux/skbuff.h:1020: warning: pointer targets in passing argument 2 of 'csum_and_copy_from_user' differ in signednessmake[4]: *** [/home/cspnico/linux-wlan-ng-0.2.1pre21/src/p80211/p80211mod.o] Erreur 1 make[3]: *** [_module_/home/cspnico/linux-wlan-ng-0.2.1pre21/src/p80211] Erreur 2 make[3]: quittant le répertoire « /usr/src/linux-headers-2.6.8.1-3-386 » make[2]: *** [default] Erreur 2 make[2]: quittant le répertoire « /home/cspnico/linux-wlan-ng-0.2.1pre21/src/p80211 » make[1]: *** [all] Erreur 2 make[1]: quittant le répertoire « /home/cspnico/linux-wlan-ng-0.2.1pre21/src » make: *** [all] Erreur 2