Compilation succeeded - 4 warning(s) /usr/bin/mcs -target:library -out:Mono.Debugger.Test.dll -debug -define:DEBUG -nowarn:0169,0067 -keyfile:../build/mono.snk -r:Mono.GetOptions -r:./Mono.Debugger.dll -r:./Mono.Debugger.Frontend.dll -r:nunit.framework ../test/testsuite/*.cs AssemblyInfo.cs error CS0006: Cannot find assembly `nunit.framework' Log: Compilation failed: 1 error(s), 0 warnings make[2]: *** [Mono.Debugger.Test.dll] Error 1 make[2]: Leaving directory `/home/dats/Desktop/mono-debugger-0.30/build' make[1]: *** [all-recursive] Error 1 make[1]: Leaving directory `/home/dats/Desktop/mono-debugger-0.30' make: *** [all] Error 2