I get some problems when compiling the hal daemon. It fails to make, I get this: make[3]: *** [lshal] Error 1 make[3]: Leaving directory `/var/tmp/portage/hal-0.5.7-r3/work/hal-0.5.7/tools' make[2]: *** [all-recursive] Error 1 make[2]: Leaving directory `/var/tmp/portage/hal-0.5.7-r3/work/hal-0.5.7/tools' make[1]: *** [all-recursive] Error 1 make[1]: Leaving directory `/var/tmp/portage/hal-0.5.7-r3/work/hal-0.5.7' make: *** [all] Error 2 !!! ERROR: sys-apps/hal-0.5.7-r3 failed. Call stack: ebuild.sh, line 1546: Called dyn_compile ebuild.sh, line 937: Called src_compile hal-0.5.7-r3.ebuild, line 140: Called die This is all after I update dbus. If there's a solution to this, I'd appreciate it. If you require more information, kindly let me know.