(cd .libs && rm -f libmono-profiler-cov.so.0 && ln -s libmono-profiler-cov.so.0.0.0 libmono-profiler-cov.so.0) (cd .libs && rm -f libmono-profiler-cov.so && ln -s libmono-profiler-cov.so.0.0.0 libmono-profiler-cov.so) ar cru .libs/libmono-profiler-cov.a mono-cov.o ranlib .libs/libmono-profiler-cov.a creating libmono-profiler-cov.la (cd .libs && rm -f libmono-profiler-cov.la && ln -s ../libmono-profiler-cov.la libmono-profiler-cov.la) make[3]: Leaving directory `/home/albertein/svn/mono-1-0/mono/mono/profiler' make[3]: Entering directory `/home/albertein/svn/mono-1-0/mono/mono' make[3]: No se hace nada para `all-am'. make[3]: Leaving directory `/home/albertein/svn/mono-1-0/mono/mono' make[2]: Leaving directory `/home/albertein/svn/mono-1-0/mono/mono' Making all in docs make[2]: Entering directory `/home/albertein/svn/mono-1-0/mono/docs' make[2]: No se hace nada para `all'. make[2]: Leaving directory `/home/albertein/svn/mono-1-0/mono/docs' Making all in data make[2]: Entering directory `/home/albertein/svn/mono-1-0/mono/data' make[2]: No se hace nada para `all'. make[2]: Leaving directory `/home/albertein/svn/mono-1-0/mono/data' Making all in runtime make[2]: Entering directory `/home/albertein/svn/mono-1-0/mono/runtime' Making all in . make[3]: Entering directory `/home/albertein/svn/mono-1-0/mono/runtime' test -f ../../mcs/monoresgen/monoresgen.exe make[3]: *** [monoresgen.exe] Error 1 make[3]: Leaving directory `/home/albertein/svn/mono-1-0/mono/runtime' make[2]: *** [all-recursive] Error 1 make[2]: Leaving directory `/home/albertein/svn/mono-1-0/mono/runtime' make[1]: *** [all-recursive] Error 1 make[1]: Leaving directory `/home/albertein/svn/mono-1-0/mono' make: *** [all] Error 2