voip:/usr/local/src/fritz# make make -C src make[1]: Entering directory `/usr/local/src/fritz/src' make -C /lib/modules/2.6.8-3-686-smp/build SUBDIRS=/usr/local/src/fritz/src modules make[2]: Entering directory `/usr/src/kernel-headers-2.6.8-3-686-smp' CC [M] /usr/local/src/fritz/src/main.o In file included from include/asm/thread_info.h:16, from include/linux/thread_info.h:21, from include/asm/uaccess.h:9, from /usr/local/src/fritz/src/main.c:24: include/asm/processor.h:87: error: array type has incomplete element type In file included from include/asm/mpspec.h:5, from include/asm/smp.h:18, from include/linux/smp.h:17, from include/linux/sched.h:23, from include/linux/module.h:10, from /usr/local/src/fritz/src/main.c:28: include/asm/mpspec_def.h:78: warning: 'packed' attribute ignored for field of type 'unsigned char[6]' In file included from /usr/local/src/fritz/src/main.c:31: include/linux/skbuff.h: In function 'skb_add_data': include/linux/skbuff.h:1016: warning: pointer targets in passing argument 2 of 'csum_and_copy_from_user' differ in signedness make[3]: *** [/usr/local/src/fritz/src/main.o] Fehler 1 make[2]: *** [_module_/usr/local/src/fritz/src] Fehler 2 make[2]: Leaving directory `/usr/src/kernel-headers-2.6.8-3-686-smp' make[1]: *** [fcpci.ko] Fehler 2 make[1]: Leaving directory `/usr/local/src/fritz/src' make: *** [src/fcpci.ko] Fehler 2