make[5]: Entering directory `/var/tmp/portage/monodevelop-0.12/work/monodevelop-0.12/Extras/AspNetEdit/chrome' cp aspdesigner.jar /usr/lib/mozilla-firefox/chrome/ ACCESS DENIED open_wr: /usr/lib/mozilla-firefox/chrome/aspdesigner.jar cp: cannot create regular file `/usr/lib/mozilla-firefox/chrome/aspdesigner.jar': Permission denied make[5]: *** [old-install-files] Error 1 make[5]: Leaving directory `/var/tmp/portage/monodevelop-0.12/work/monodevelop-0.12/Extras/AspNetEdit/chrome' make[4]: *** [install-data-am] Error 2 make[4]: Leaving directory `/var/tmp/portage/monodevelop-0.12/work/monodevelop-0.12/Extras/AspNetEdit/chrome' make[3]: *** [install-am] Error 2 make[3]: Leaving directory `/var/tmp/portage/monodevelop-0.12/work/monodevelop-0.12/Extras/AspNetEdit/chrome' make[2]: *** [install-recursive] Error 1 make[2]: Leaving directory `/var/tmp/portage/monodevelop-0.12/work/monodevelop-0.12/Extras/AspNetEdit' make[1]: *** [install-recursive] Error 1 make[1]: Leaving directory `/var/tmp/portage/monodevelop-0.12/work/monodevelop-0.12/Extras' make: *** [install-recursive] Error 1 !!! ERROR: dev-util/monodevelop-0.12 failed. Call stack: ebuild.sh, line 1546: Called dyn_install ebuild.sh, line 1020: Called src_install monodevelop-0.12.ebuild, line 55: Called die !!! (no error message) !!! If you need support, post the topmost build error, and the call stack if relevant. --------------------------- ACCESS VIOLATION SUMMARY --------------------------- LOG FILE = "/var/log/sandbox/sandbox-dev-util_-_monodevelop-0.12-8755.log" open_wr: /usr/lib/mozilla-firefox/chrome/aspdesigner.jar