1. e-tree-memory.c: In function 'e_tree_memory_node_insert': 2. e-tree-memory.c:507: warning: implicit declaration of function 'g_slice_new0' 3. e-tree-memory.c:507: error: expected expression before 'ETreeMemoryPath' 4. e-tree-memory.c:507: warning: assignment makes pointer from integer without a cast 5. e-tree-memory.c: In function 'child_free': 6. e-tree-memory.c:582: warning: implicit declaration of function 'g_slice_free' 7. e-tree-memory.c:582: error: expected expression before 'ETreeMemoryPath' 8. make[3]: *** [e-tree-memory.lo] Error 1 9. make[3]: Leaving directory `/home/novell/cvs/gnome2/evolution/widgets/table' 10. make[2]: *** [all-recursive] Error 1 11. make[2]: Leaving directory `/home/novell/cvs/gnome2/evolution/widgets' 12. make[1]: *** [all-recursive] Error 1 13. make[1]: Leaving directory `/home/novell/cvs/gnome2/evolution' 14. make: *** [all] Error 2 15. *** error during stage build of evolution: Error running make *** [1/1] 16. 17. 18. [1] rerun stage build 19. [2] ignore error and continue to install 20. [3] give up on module 21. [4] start shell 22. [5] go to stage force_checkout 23. [6] go to stage configure 24. choice: