In file included from /home/kde-devel/build/multimedia/amarok/src/deletedialog.h:24, from /home/kde-devel/build/multimedia/amarok/src/collectionbrowser.cpp:20: /home/kde-devel/build/amarok-build/amarok/src/ui_deletedialogbase.h:25:23: error: k3listbox.h: No such file or directory /home/kde-devel/build/amarok-build/amarok/src/ui_deletedialogbase.h:36: error: ISO C++ forbids declaration of 'K3ListBox' with no type /home/kde-devel/build/amarok-build/amarok/src/ui_deletedialogbase.h:36: error: expected ';' before '*' token /home/kde-devel/build/amarok-build/amarok/src/ui_deletedialogbase.h: In member function 'void Ui_DeleteDialogBase::setupUi(QWidget*)': /home/kde-devel/build/amarok-build/amarok/src/ui_deletedialogbase.h:81: error: 'ddFileList' was not declared in this scope /home/kde-devel/build/amarok-build/amarok/src/ui_deletedialogbase.h:81: error: expected type-specifier before 'K3ListBox' /home/kde-devel/build/amarok-build/amarok/src/ui_deletedialogbase.h:81: error: expected `;' before 'K3ListBox' /home/kde-devel/build/amarok-build/amarok/src/ui_deletedialogbase.h:83: error: 'K3ListBox' has not been declared /home/kde-devel/build/amarok-build/amarok/src/ui_deletedialogbase.h: In member function 'void Ui_DeleteDialogBase::retranslateUi(QWidget*)': /home/kde-devel/build/amarok-build/amarok/src/ui_deletedialogbase.h:115: error: 'ddFileList' was not declared in this scope make[2]: *** [amarok/src/CMakeFiles/amarok.dir/collectionbrowser.o] Error make[2]: Leaving directory `/home/kde-devel/build/amarok-build' make[1]: *** [amarok/src/CMakeFiles/amarok.dir/all] Error 2 make[1]: Leaving directory `/home/kde-devel/build/amarok-build' make: *** [all] Error 2