In file included from ../include/objects.h:8, from ../include/zsfunctions.h:40, from zipscript-c.c:22: ../include/constants.h:366: error: syntax error before âenumâ In file included from ../include/zsfunctions.h:40, from zipscript-c.c:22: ../include/objects.h:41: error: syntax error before âstructâ In file included from zipscript-c.c:22: ../include/zsfunctions.h:78: error: syntax error before âstructâ In file included from zipscript-c.c:34: ../include/multimedia.h:6: error: syntax error before âcharâ zipscript-c.c:51: error: syntax error before âintâ make[1]: *** [zipscript-c.o] Error 1 make[1]: Leaving directory `/home/mike/project-zs-ng_r2040-v1.0.1b/zipscript/src' make: *** [zs] Error 2