ERROR: function do_compile failed ERROR: log data follows (/home/luke-jr/src/oe2005/build.alt/tmp/work/linux-openzaurus-2.6.14+2.6.15-rc7-r2/temp/log.do_compile.8475) | NOTE: make OPENZAURUS_RELEASE=-mt include/linux/version.h CC=ccache arm-linux-gcc LD=arm-linux-ld | CHK include/linux/version.h | NOTE: make OPENZAURUS_RELEASE=-mt zImage CC=ccache arm-linux-gcc LD=arm-linux-ld | CHK include/linux/version.h | make[1]: `include/asm-arm/mach-types.h' is up to date. | CHK include/linux/compile.h | CHK usr/initramfs_list | CC arch/arm/mach-pxa/corgi.o | In file included from arch/arm/mach-pxa/corgi.c:47: | arch/arm/mach-pxa/sharpsl.h:57: error: array type has incomplete element type | arch/arm/mach-pxa/sharpsl.h:58: error: array type has incomplete element type | make[1]: *** [arch/arm/mach-pxa/corgi.o] Error 1 | make: *** [arch/arm/mach-pxa] Error 2 | FATAL: oe_runmake failed NOTE: Task failed: /home/luke-jr/src/oe2005/build.alt/tmp/work/linux-openzaurus-2.6.14+2.6.15-rc7-r2/temp/log.do_compile.8475 NOTE: package linux-openzaurus-2.6.14+2.6.15-rc7-r2: task do_compile: failed ERROR: TaskFailed event exception, aborting NOTE: package linux-openzaurus-2.6.14+2.6.15-rc7: failed ERROR: Build of ljr failed