make Checking SVN revision... * Building libtransmission Checking dependencies... Cc transmission.o Cc bencode.o Cc net.o Cc tracker.o Cc peer.o Cc inout.o Cc metainfo.o Cc sha1.o Cc utils.o Cc fdlimit.o Cc clients.o Cc completion.o Cc platform.o Cc ratecontrol.o Cc choking.o Cc natpmp.o Cc upnp.o Cc http.o Cc xml.o Cc shared.o Cc torrent.o Library libtransmission.a * Building Transmission CLI client Checking dependencies... Cc transmissioncli.o transmissioncli.c: In function `main': transmissioncli.c:243: warning: implicit declaration of function `tr_natTraversalStatus' Link transmissioncli transmissioncli.o(.text+0x3b7): In function `main': /home/.cattspurr/snarf771/dev.spontaneousdancing.net/transmission/cli/transmissioncli.c:243: undefined reference to `tr_natTraversalStatus' transmissioncli.o(.text+0x3d7):/home/.cattspurr/snarf771/dev.spontaneousdancing.net/transmission/cli/transmissioncli.c:243: undefined reference to `tr_natTraversalStatus' transmissioncli.o(.text+0x3f3):/home/.cattspurr/snarf771/dev.spontaneousdancing.net/transmission/cli/transmissioncli.c:243: undefined reference to `tr_natTraversalStatus' transmissioncli.o(.text+0x40f):/home/.cattspurr/snarf771/dev.spontaneousdancing.net/transmission/cli/transmissioncli.c:243: undefined reference to `tr_natTraversalStatus' transmissioncli.o(.text+0x42b):/home/.cattspurr/snarf771/dev.spontaneousdancing.net/transmission/cli/transmissioncli.c:243: undefined reference to `tr_natTraversalStatus' collect2: ld returned 1 exit status Compile line for transmissioncli was: cc -o transmissioncli transmissioncli.o ../libtransmission/libtransmission.a -lpthread -lcrypto -lm make[2]: *** [transmissioncli] Error 1 make[1]: *** [.cli] Error 2 make: *** [all] Error 2