[root@gnagni /]# cd rt2570-cvs-2007021716/ [root@gnagni rt2570-cvs-2007021716]# cd module bash: cd: module: No such file or directory [root@gnagni rt2570-cvs-2007021716]# cd Module/ [root@gnagni Module]# make && make install make[1]: Entering directory `/usr/src/kernels/2.6.19-1.2911.fc6-i686' CC [M] /rt2570-cvs-2007021716/Module/rtusb_main.o In file included from /rt2570-cvs-2007021716/Module/rt_config.h:171, from /rt2570-cvs-2007021716/Module/rtusb_main.c:36: /rt2570-cvs-2007021716/Module/rt2570sw.h:74:2: error: #error Sorry, this nice piece of code was not designed with SMP in mind. make[2]: *** [/rt2570-cvs-2007021716/Module/rtusb_main.o] Error 1 make[1]: *** [_module_/rt2570-cvs-2007021716/Module] Error 2 make[1]: Leaving directory `/usr/src/kernels/2.6.19-1.2911.fc6-i686' rt2570.ko failed to build! make: *** [module] Error 1 You have new mail in /var/