test 528...OK (309 out of 316, remaining: 00:05) test 529...OK (310 out of 316, remaining: 00:05) test 530...OK (311 out of 316, remaining: 00:04) test 531...OK (312 out of 316, remaining: 00:03) test 532...OK (313 out of 316, remaining: 00:02) test 533...OK (314 out of 316, remaining: 00:01) test 534...FAILED test 535...OK (316 out of 316, remaining: 00:00) TESTDONE: 306 tests out of 308 reported OK: 99% TESTFAIL: These test cases failed: 507 534 TESTDONE: 316 tests were considered during 320 seconds. TESTINFO: 8 tests were skipped due to these restraints: TESTINFO: "Resolving 'ip6-localhost' didn't work" 1 times (241) TESTINFO: "rlimit problems" 1 times (518) TESTINFO: "curl lacks netrc_debug support" 6 times (130, 131, 132, 133, 134, 257) make[1]: *** [quiet-test] Erreur 1 make[1]: Leaving directory `/home/sshtenchi/rpm/BUILD/curl-7.16.0/tests' make: *** [test] Erreur 2 erreur: Mauvais status de sortie pour /home/sshtenchi/rpm/tmp/rpm-tmp.67228 (%check) Erreur de construction de RPM: Mauvais status de sortie pour /home/sshtenchi/rpm/tmp/rpm-tmp.67228 (%check)