gcc -pipe -Wall -Wstrict-prototypes -Wmissing-prototypes -Wmissing-declarations -g -Iinclude -I../include -D_REENTRANT -D_GNU_SOURCE -O6 -march=i686 -DZAPT EL_OPTIMIZATIONS -DASTERISK_VERSION=\"CVS-v1-0-10/29/04-15:22:18\" -DASTERISK_V ERSION_NUM=999999 -DINSTALL_PREFIX=\"\" -DASTETCDIR=\"/etc/asterisk\" -DASTLIBDI R=\"/usr/lib/asterisk\" -DASTVARLIBDIR=\"/var/lib/asterisk\" -DASTVARRUNDIR=\"/v ar/run\" -DASTSPOOLDIR=\"/var/spool/asterisk\" -DASTLOGDIR=\"/var/log/asterisk\" -DASTCONFPATH=\"/etc/asterisk/asterisk.conf\" -DASTMODDIR=\"/usr/lib/asterisk/m odules\" -DASTAGIDIR=\"/var/lib/asterisk/agi-bin\" -DBUSYDETECT_MARTIN -Wno-missing-prototypes -Wno-missing-declarations -DZAPATA_PRI -DIAX_TRUNKIN G -DCRYPTO -fPIC -c -o chan_sip.o chan_sip.c chan_sip.c:6153:20: macro "ASTOBJ_CONTAINER_TRAVERSE" requires 3 arguments, but only 2 given chan_sip.c: In function `complete_sippeer': chan_sip.c:6144: error: `ASTOBJ_CONTAINER_TRAVERSE' undeclared (first use in thi s function) chan_sip.c:6144: error: (Each undeclared identifier is reported only once chan_sip.c:6144: error: for each function it appears in.) chan_sip.c:6141: warning: unused variable `which' make[1]: *** [chan_sip.o] Error 1 make[1]: Leaving directory `/usr/src/asterisk/channels' make: *** [subdirs] Error 1 root@sip1:/usr/src/asterisk#