make -C /lib/modules/2.6.20-viper4/build SUBDIRS=/home/drbombay/usb-rndis-lite modules make[1]: Entering directory `/usr/src/linux-2.6.20-viper4' CC [M] /home/drbombay/usb-rndis-lite/usbnet.o /home/drbombay/usb-rndis-lite/usbnet.c:1153:38: error: macro "INIT_WORK" passed 3 arguments, but takes just 2 /home/drbombay/usb-rndis-lite/usbnet.c: In function 'usbnet_probe': /home/drbombay/usb-rndis-lite/usbnet.c:1153: error: 'INIT_WORK' undeclared (first use in this function) /home/drbombay/usb-rndis-lite/usbnet.c:1153: error: (Each undeclared identifier is reported only once /home/drbombay/usb-rndis-lite/usbnet.c:1153: error: for each function it appears in.) make[2]: *** [/home/drbombay/usb-rndis-lite/usbnet.o] Error 1 make[1]: *** [_module_/home/drbombay/usb-rndis-lite] Error 2 make[1]: Leaving directory `/usr/src/linux-2.6.20-viper4' make: *** [default] Error 2