| Importing patch /home/oe/org.openembedded.dev/packages/glibc/glibc-cvs-2.3.5/arm-audit.patch (stored as arm-audit.patch) | Applying patch arm-audit.patch | patching file sysdeps/generic/ldsodefs.h | Hunk #1 succeeded at 211 (offset 8 lines). | Hunk #2 FAILED at 294. | Hunk #3 FAILED at 366. | 2 out of 3 hunks FAILED -- rejects in file sysdeps/generic/ldsodefs.h | patching file elf/tst-auditmod1.c | Hunk #1 FAILED at 192. | 1 out of 1 hunk FAILED -- rejects in file elf/tst-auditmod1.c | Patch arm-audit.patch does not apply (enforce with -f) NOTE: Task failed: /home/oe/oetemp/work/armv5te-linux/glibc-2.3.5+cvs20060119-r0/temp/log.do_patchcmd.29727 NOTE: package glibc-2.3.5+cvs20060119-r0: task do_patch: failed ERROR: TaskFailed event exception, aborting NOTE: package glibc-2.3.5+cvs20060119: failed ERROR: Build of 'glibc' failed