/home/jason/asterisksrc/zaptel/ztcodec_dte/base.c: In function `wcdte_boot_processor': /home/jason/asterisksrc/zaptel/ztcodec_dte/base.c:1448: error: `_binary_dte_firm_ima_start' undeclared (first use in this function) /home/jason/asterisksrc/zaptel/ztcodec_dte/base.c:1448: error: (Each undeclared identifier is reported only once /home/jason/asterisksrc/zaptel/ztcodec_dte/base.c:1448: error: for each function it appears in.) make[3]: *** [/home/jason/asterisksrc/zaptel/ztcodec_dte/base.o] Error 1 make[2]: *** [/home/jason/asterisksrc/zaptel/ztcodec_dte] Error 2 make[1]: *** [_module_/home/jason/asterisksrc/zaptel] Error 2 make[1]: Leaving directory `/usr/src/linux-2.6.16.20' make: *** [linux26] Error 2