vo/lib/libglib-2.0.so -Wl,--rpath -Wl,/opt/evo/lib /opt/evo/lib/libgobject-2.0.so: undefined reference to `g_intern_static_string' /opt/evo/lib/libgobject-2.0.so: undefined reference to `g_intern_string' /opt/evo/lib/libgobject-2.0.so: undefined reference to `g_slice_alloc' /opt/evo/lib/libgobject-2.0.so: undefined reference to `g_hash_table_ref' /opt/evo/lib/libgobject-2.0.so: undefined reference to `g_slice_alloc0' /opt/evo/lib/libgobject-2.0.so: undefined reference to `g_hash_table_unref' /opt/evo/lib/libgobject-2.0.so: undefined reference to `g_slice_free1' collect2: ld returned 1 exit status make[2]: *** [testgtkhtml] Error 1 make[2]: Leaving directory `/home/venkat/cvs/gnome/gtkhtml/src' make[1]: *** [all-recursive] Error 1 make[1]: Leaving directory `/home/venkat/cvs/gnome/gtkhtml' make: *** [all] Error 2 *** error during stage build of gtkhtml: could not build module *** [1/1]