magnatunedownloaddialog.h:35: error: expected class-name before '{' token magnatunedownloaddialog.h:46: error: 'WFlags' has not been declared magnatuneredownloaddialog.h:29: error: expected class-name before '{' token magnatuneredownloaddialog.h:33: error: 'WFlags' has not been declared make[4]: *** [magnatuneredownloadhandler.moc.lo] Error 1 make[4]: *** Waiting for unfinished jobs.... Session management error: Could not open network socket Session management error: Could not open network socket Session management error: Could not open network socket make[4]: Leaving directory `/var/tmp/portage/media-sound/amarok-1.4.5-r1/work/amarok-1.4.5/amarok/src/magnatunebrowser' make[3]: *** [all-recursive] Error 1 make[3]: Leaving directory `/var/tmp/portage/media-sound/amarok-1.4.5-r1/work/amarok-1.4.5/amarok/src' make[2]: *** [all-recursive] Error 1 make[2]: Leaving directory `/var/tmp/portage/media-sound/amarok-1.4.5-r1/work/amarok-1.4.5/amarok' make[1]: *** [all-recursive] Error 1 make[1]: Leaving directory `/var/tmp/portage/media-sound/amarok-1.4.5-r1/work/amarok-1.4.5' make: *** [all] Error 2 !!! ERROR: media-sound/amarok-1.4.5-r1 failed. Call stack: ebuild.sh, line 1614: Called dyn_compile ebuild.sh, line 971: Called qa_call 'src_compile' environment, line 4766: Called src_compile amarok-1.4.5-r1.ebuild, line 76: Called kde_src_compile kde.eclass, line 171: Called kde_src_compile 'all' kde.eclass, line 341: Called kde_src_compile 'myconf' 'configure' 'make' kde.eclass, line 337: Called die !!! died running emake, kde_src_compile:make !!! If you need support, post the topmost build error, and the call stack if relevant. !!! A complete build log is located at '/var/tmp/portage/media-sound/amarok-1.4.5-r1/temp/build.log'.