../include/time.h:105: warning: 'stdcall' attribute ignored In file included from ../inet/netinet/in.h:24, from ../include/netinet/in.h:3, from ../resolv/resolv.h:57, from ../include/resolv.h:12, from ../nptl/descr.h:39, from ../nptl/sysdeps/i386/i686/../tls.h:105, from ../nptl/sysdeps/i386/i686/tls.h:34, from ../include/tls.h:6, from ../sysdeps/unix/sysv/linux/i386/sysdep.h:30, from :1: ../include/sys/socket.h:21: warning: 'stdcall' attribute ignored make[2]: *** [/var/tmp/portage/sys-libs/glibc-2.5-r1/work/build-x86-x86_64-pc-linux-gnu-nptl/tcb-offsets.h] Error 1 make[2]: Leaving directory `/var/tmp/portage/sys-libs/glibc-2.5-r1/work/glibc-2.5/csu' make[1]: *** [csu/subdir_lib] Error 2 make[1]: Leaving directory `/var/tmp/portage/sys-libs/glibc-2.5-r1/work/glibc-2.5' make: *** [all] Error 2 !!! ERROR: sys-libs/glibc-2.5-r1 failed. Call stack: ebuild.sh, line 1614: Called dyn_compile ebuild.sh, line 971: Called qa_call 'src_compile' environment, line 4175: Called src_compile glibc-2.5-r1.ebuild, line 1150: Called src_compile glibc-2.5-r1.ebuild, line 1161: Called toolchain-glibc_src_compile glibc-2.5-r1.ebuild, line 270: Called die !!! make for x86 failed !!! If you need support, post the topmost build error, and the call stack if relevant. !!! A complete build log is located at '/var/tmp/portage/sys-libs/glibc-2.5-r1/temp/build.log'.